Nie jesteś zalogowany.
Jeśli nie posiadasz konta, zarejestruj je już teraz! Pozwoli Ci ono w pełni korzystać z naszego serwisu. Spamerom dziękujemy!
Prosimy o pomoc dla małej Julki — przekaż 1% podatku na Fundacji Dzieciom zdazyć z Pomocą.
Więcej informacji na dug.net.pl/pomagamy/.
probóje zainstalować iproute na sarge ale mi sie ciągle niewychodzi
iproute oraz kernel są spatchowane podczas kompilacji iproute mam :
arpd.c:365: error: request for member `del' in something not a structure or union arpd.c:391: error: request for member `put' in something not a structure or union arpd.c:409: error: request for member `put' in something not a structure or union arpd.c:421: error: request for member `put' in something not a structure or union arpd.c: In function `get_arp_pkt': arpd.c:485: error: `DBT' undeclared (first use in this function) arpd.c:485: error: syntax error before "dbkey" arpd.c:517: error: `dbkey' undeclared (first use in this function) arpd.c:520: error: request for member `get' in something not a structure or union arpd.c:520: error: `dbdat' undeclared (first use in this function) arpd.c:530: error: request for member `put' in something not a structure or union arpd.c: In function `main': arpd.c:670: warning: implicit declaration of function `dbopen' arpd.c:670: error: `DB_HASH' undeclared (first use in this function) arpd.c:670: warning: assignment makes pointer from integer without a cast arpd.c:680: error: `DBT' undeclared (first use in this function) arpd.c:680: error: syntax error before "dbkey" arpd.c:682: error: `dbkey' undeclared (first use in this function) arpd.c:712: error: `dbdat' undeclared (first use in this function) arpd.c:717: error: request for member `put' in something not a structure or union arpd.c:722: error: request for member `sync' in something not a structure or union arpd.c:728: error: syntax error before "dbkey" arpd.c:730: error: request for member `seq' in something not a structure or union arpd.c:730: error: `R_NEXT' undeclared (first use in this function) arpd.c:822: error: request for member `sync' in something not a structure or union arpd.c:841: error: request for member `close' in something not a structure or union arpd.c:845: error: request for member `close' in something not a structure or union make[1]: *** [arpd] Błąd 1
Offline
Hmm a nie prościej apt-get install iproute ?
Offline
dla przyszłych pokoleń :
Trzeba zainstalowac pakiety :
libdb2 2.7.7.0-7 The Berkeley database routines libdb3 3.2.9-16 Berkeley v3 Database Libraries [runtime] libdb3++ 3.2.9-16 Berkeley v3 Database Libraries for C++ [runtime] libdb3++-dev 3.2.9-16 Berkeley v3 Database Libraries for C++ [development] libdb3-dev 3.2.9-16 Berkeley v3 Database Libraries [development] libdb3-util 3.2.9-16 Berkeley v3 Database Utilities
Offline