Nie jesteś zalogowany.
Jeśli nie posiadasz konta, zarejestruj je już teraz! Pozwoli Ci ono w pełni korzystać z naszego serwisu. Spamerom dziękujemy!
Prosimy o pomoc dla małej Julki — przekaż 1% podatku na Fundacji Dzieciom zdazyć z Pomocą.
Więcej informacji na dug.net.pl/pomagamy/.
instaluje pdfedit z zrodel
z opisu wynika ze potzrebuje library boost ... nawet configure wyrzuca
configure: error: You need boost iostreams library to compile PDFedit
gdzie to znalezc?
dodam ze mam stable
Offline
no ta juz mam
znalazlem podpobny post
http://www.dug.net.pl/forum/viewtopic.php?t=5724&am … c&start=0
i wynika z niego ze jeszcze potrzebuje
libboost-iostreams-dev
libboost-iostreams1.33.1
chyba ze ktos ma gotowego deba z pdfedit?
Offline
witam wlasnie probuje zrobic paczke z pdfedit i jak daje make wywala mi błąd
make[2]: Wejście do katalogu `/home/siarka/Desktop/pdfedit-0.2.3/src/kpdf-kde-3.3.2'
g++ -c -pipe -g -Wall -W -O2 -D_REENTRANT -DQT_NO_DEBUG -DQT_THREAD_SUPPORT -I/usr/share/qt3/mkspecs/default -I. -I../xpdf -I../xpdf/xpdf -I../xpdf/goo -I../xpdf/splash -I../xpdf/fofi -I/usr/share/qt3/include -o QOutputDevPixmap.o QOutputDevPixmap.cpp
QOutputDevPixmap.cpp:25:21: error: qpixmap.h: Nie ma takiego pliku ani katalogu
QOutputDevPixmap.cpp:26:20: error: qimage.h: Nie ma takiego pliku ani katalogu
QOutputDevPixmap.h:40: error: 'QImage' does not name a type
QOutputDevPixmap.h:43: error: 'QImage' does not name a type
QOutputDevPixmap.cpp: In constructor 'QOutputDevPixmap::QOutputDevPixmap(Guchar*)':
QOutputDevPixmap.cpp:39: error: class 'QOutputDevPixmap' does not have any field named 'm_image'
QOutputDevPixmap.cpp: In destructor 'virtual QOutputDevPixmap::~QOutputDevPixmap()':
QOutputDevPixmap.cpp:46: error: 'free' was not declared in this scope
QOutputDevPixmap.cpp: In member function 'virtual void QOutputDevPixmap::endPage()':
QOutputDevPixmap.cpp:60: error: 'free' was not declared in this scope
QOutputDevPixmap.cpp:61: error: 'malloc' was not declared in this scope
QOutputDevPixmap.cpp:62: error: 'm_image' was not declared in this scope
QOutputDevPixmap.cpp:78: error: 'm_image' was not declared in this scope
QOutputDevPixmap.cpp:78: error: 'uchar' was not declared in this scope
QOutputDevPixmap.cpp:78: error: expected primary-expression before ')' token
QOutputDevPixmap.cpp:78: error: 'QImage' has not been declared
QOutputDevPixmap.cpp:78: error: 'QImage' was not declared in this scope
make[2]: *** [QOutputDevPixmap.o] Błąd 1
make[2]: Opuszczenie katalogu `/home/siarka/Desktop/pdfedit-0.2.3/src/kpdf-kde-3.3.2'
make[1]: *** [qoutputdevices] Błąd 2
make[1]: Opuszczenie katalogu `/home/siarka/Desktop/pdfedit-0.2.3/src'
make: *** [src] Błąd 2
moze wie ktos o co chodzi?? bo szukalem troche ale nic nie znalazłem
Offline
o co w tym chodzi???
niby nie ma tych plikow
QOutputDevPixmap.cpp:25:21: error: qpixmap.h: Nie ma takiego pliku ani katalogu QOutputDevPixmap.cpp:26:20: error: qimage.h: Nie ma takiego pliku ani katalogu
jakis pakiet jest za nie odpowiedzialny??
czy podczas kompilacji nie zrobilo ich sobie w zrodlach??
jakies propozycje?? pozdro
Offline
Kompilacja wymaga dołączenia plików nagłówkowych qpixmap.h, których nie może znaleźć. Zobacz czy masz je w katalogu /usr/share/qt3/include/
I tak w ogóle to czytałeś: http://www.dug.net.pl/forum/viewtopic.php?t=5724&am … c&start=0 ?
Offline
czytałem i exportuje ta zmienna no ale dalej ten sam błąd
Offline
dobra juz dalem rade trzabyło zainstalowac libqt3-mt-dev i poszlo. paczuszka gotowa pod i386, wiec jak ktosby byl chetny niech da znac, choc nie wiem czy wszystko w niej jest ok, bo dopiero jestem poczatkujacym w paczkowaniu, ale u mnie dziala
Offline
podaj e-mail, albo gdzies na serwer wrzuce. narazie jestem w szkole wiec pod wieczor albo w poniedzialek wrzuce albo ci na e-mail, albo gdzies na serwer i podam linka
Offline