Nie jesteś zalogowany.
Jeśli nie posiadasz konta, zarejestruj je już teraz! Pozwoli Ci ono w pełni korzystać z naszego serwisu. Spamerom dziękujemy!
Prosimy o pomoc dla małej Julki — przekaż 1% podatku na Fundacji Dzieciom zdazyć z Pomocą.
Więcej informacji na dug.net.pl/pomagamy/.
Witam, podczas próby kompilacji pakietu dsniff wypluwa mi błąd. Polecenie configure przechodzi bez żadnego problemu, natomiast make wyświetla taki błąd:
draculla:/home/michal/dsniff-2.3# make gcc -g -O2 -D_BSD_SOURCE -D_BSD_SOURCE -D__BSD_SOURCE -D__FAVOR_BSD -DHAVE_NET_ETHERNET_H -DDSNIFF_LIBDIR=\"/usr/local/lib/\" -I. -I./missing -c ./sshcrypto.c ./sshcrypto.c:25: error: field ‘key’ has incomplete type ./sshcrypto.c:30: error: expected specifier-qualifier-list before ‘des_key_schedule’ ./sshcrypto.c: In function ‘blowfish_encrypt’: ./sshcrypto.c:131: error: ‘BF_ENCRYPT’ undeclared (first use in this function) ./sshcrypto.c:131: error: (Each undeclared identifier is reported only once ./sshcrypto.c:131: error: for each function it appears in.) ./sshcrypto.c: In function ‘blowfish_decrypt’: ./sshcrypto.c:143: error: ‘BF_DECRYPT’ undeclared (first use in this function) ./sshcrypto.c: In function ‘des3_init’: ./sshcrypto.c:156: error: ‘struct des3_state’ has no member named ‘k1’ ./sshcrypto.c:157: error: ‘struct des3_state’ has no member named ‘k2’ ./sshcrypto.c:160: error: ‘struct des3_state’ has no member named ‘k3’ ./sshcrypto.c:162: error: ‘struct des3_state’ has no member named ‘k3’ ./sshcrypto.c:164: error: ‘struct des3_state’ has no member named ‘iv1’ ./sshcrypto.c:165: error: ‘struct des3_state’ has no member named ‘iv2’ ./sshcrypto.c:166: error: ‘struct des3_state’ has no member named ‘iv3’ ./sshcrypto.c: In function ‘des3_encrypt’: ./sshcrypto.c:176: error: ‘struct des3_state’ has no member named ‘iv1’ ./sshcrypto.c:176: error: ‘struct des3_state’ has no member named ‘iv2’ ./sshcrypto.c:178: error: ‘struct des3_state’ has no member named ‘k1’ ./sshcrypto.c:178: error: ‘struct des3_state’ has no member named ‘iv1’ ./sshcrypto.c:178: error: ‘DES_ENCRYPT’ undeclared (first use in this function) ./sshcrypto.c:179: error: ‘struct des3_state’ has no member named ‘k2’ ./sshcrypto.c:179: error: ‘struct des3_state’ has no member named ‘iv2’ ./sshcrypto.c:179: error: ‘DES_DECRYPT’ undeclared (first use in this function) ./sshcrypto.c:180: error: ‘struct des3_state’ has no member named ‘k3’ ./sshcrypto.c:180: error: ‘struct des3_state’ has no member named ‘iv3’ ./sshcrypto.c: In function ‘des3_decrypt’: ./sshcrypto.c:189: error: ‘struct des3_state’ has no member named ‘iv1’ ./sshcrypto.c:189: error: ‘struct des3_state’ has no member named ‘iv2’ ./sshcrypto.c:191: error: ‘struct des3_state’ has no member named ‘k3’ ./sshcrypto.c:191: error: ‘struct des3_state’ has no member named ‘iv3’ ./sshcrypto.c:191: error: ‘DES_DECRYPT’ undeclared (first use in this function) ./sshcrypto.c:192: error: ‘struct des3_state’ has no member named ‘k2’ ./sshcrypto.c:192: error: ‘struct des3_state’ has no member named ‘iv2’ ./sshcrypto.c:192: error: ‘DES_ENCRYPT’ undeclared (first use in this function) ./sshcrypto.c:193: error: ‘struct des3_state’ has no member named ‘k1’ ./sshcrypto.c:193: error: ‘struct des3_state’ has no member named ‘iv1’ make: *** [sshcrypto.o] Błąd 1 draculla:/home/michal/dsniff-2.3#
jak sobie z tym poradzić?
Offline
Nie lepiej zainstalować z paczki? Nawet będziesz miał nowszą wersję niż to co instalujesz.
Offline
Miałeś rację, poszło z paczki, musiałem tylko kilka bibliotek doinstalować, dzięki za pomoc.
Offline